{"text_format":"1","workbook":"xlsx","n_sheets":19,"sheets":["Summary","Assumptions","Input Form","By Term Summary","General Input","UG Trad Input","UG Non-Trad Input","Grad Input","Certificate Input","Endow&Gift Input","Expense Input","DEFS","prt_T_UG","prt_NT_UG","prt_GRAD","prt_CERT_FR","prt_CERT_CH","prt_OthRev","prt_Expenses"],"not_rendered":{"charts":0,"images":0,"macros":1,"external_links":0,"defined_names":549,"comments":2,"pivot_tables":0},"unopened":[],"bounds":{"document_bytes":16777216,"sheet_cells":100000,"rows_first":2000,"rows_last":500,"rows_between":2000,"halvings":0,"cell_chars":16384,"cell_head_chars":4096},"cells_cut":0,"cells_raw":0,"read":"whole","date_system":"1900"}

{"sheet":"Summary","index":0,"n_rows":94,"n_cols":7,"rows_kept":94,"cut":false,"hidden":false,"merged":[[95,0,95,6]]}
["Creighton University"]
[{"$f":"IF(ISBLANK('General Input'!B5),\"\",'General Input'!B5)","v":""}]
[{"$f":"IF(ISBLANK('General Input'!B7),\"\",'General Input'!B7)","v":""}]
[{"$f":"IF(ISBLANK('General Input'!B6),\"\",'General Input'!B6)","v":""},"2014-2015","2015-2016","2016-2017","2017-2018","2018-2019"]
["Five Year Financial Projections","Year 1","Year 2","Year 3","Year 4","Year 5","5 Year Total"]
[{"$f":"CONCATENATE(\"Contact\",\":\",\" \",'General Input'!B8)","v":"Contact: "},"Fiscal Year","Fiscal Year","Fiscal Year","Fiscal Year","Fiscal Year"]
["Revenue"]
["  Tuition"]
{"$rows_left_out":87}
{"sheet":"Assumptions","index":1,"n_rows":26,"n_cols":10,"rows_kept":26,"cut":false,"hidden":true,"merged":[[0,8,0,11]]}
[{"$f":"Summary!A1","v":"Creighton University"},null,null,null,null,null,null,null,"Legend:"]
[{"$f":"Summary!A2","v":""},null,null,null,null,null,null,null,null,"Standard assumption, no changes"]
[{"$f":"Summary!A6","v":"Contact: "},"2014-2015","2015-2016","2016-2017","2017-2018","2018-2019",null,null,null,"Assumption input cell"]
["General assumptions:","Year 1","Year 2","Year 3","Year 4","Year 5",null,null,null,"Calculated cell"]
["Program Type:"]
["Annual growth rate for tuition and fees",null,2.5000000000000001E-2,2.5000000000000001E-2,2.5000000000000001E-2,2.5000000000000001E-2]
["Traditional undergraduate tuition rate per semester",16898,{"$f":"ROUND(B7*(1+C$6),0)","v":17320},17753,18197,18652,"2013-2014 actual"]
["Non-traditional undergraduate tuition rate",412,{"$f":"ROUND(B8*(1+C$6),0)","v":422},433,444,455,"Default is based on BILS program"]
{"$rows_left_out":19}
{"sheet":"Input Form","index":2,"n_rows":10,"n_cols":9,"rows_kept":10,"cut":false,"hidden":false,"merged":[]}
["New Program Financial Projection Template",null,null,null,null,null,null,null,"version 2"]
[]
[null,"You may receive the following Security Warnings when you open this file:"]
[null,null,"Macros have been disabled."]
[null,null,null,"Click on \"Enable Content\""]
[]
[null,null,"Do you want to make this file a Trusted Document?"]
[null,null,null,"It's okay to click on \"Yes\""]
{"$rows_left_out":3}
{"sheet":"By Term Summary","index":3,"n_rows":89,"n_cols":36,"rows_kept":89,"cut":false,"hidden":true,"merged":[[4,1,4,7],[4,8,4,14],[4,15,4,21],[4,22,4,28],[4,29,4,35]]}
["Creighton University"]
[{"$f":"'General Input'!B5","v":0}]
[{"$f":"'General Input'!B7","v":0}]
[{"$f":"'General Input'!B6","v":0}]
["5 year financial projections","Year 1",null,null,null,null,null,null,"Year 2",null,null,null,null,null,null,"Year 3",null,null,null,null,null,null,"Year 4",null,null,null,null,null,null,"Year 5"]
[null,"Summer Term 2","Fall Term 1","Fall Term 2","Winter Term","Spring Term 1","Spring Term 2","Summer Term 1","Summer Term 2","Fall Term 1","Fall Term 2","Winter Term","Spring Term 1","Spring Term 2","Summer Term 1","Summer Term 2","Fall Term 1","Fall Term 2","Winter Term","Spring Term 1","Spring Term 2","Summer Term 1","Summer Term 2","Fall Term 1","Fall Term 2","Winter Term","Spring Term 1","Spring Term 2","Summer Term 1","Summer Term 2","Fall Term 1","Fall Term 2","Winter Term","Spring Term 1","Spring Term 2","Summer Term 1"]
["Revenue"]
["  Tuition"]
{"$rows_left_out":82}
{"sheet":"General Input","index":4,"n_rows":16,"n_cols":3,"rows_kept":16,"cut":false,"hidden":true,"merged":[[7,30,7,36],[0,1,0,4],[7,2,7,8],[7,9,7,15],[7,16,7,22],[7,23,7,29]]}
["Creighton University","Legend:"]
["New program financial proforma",null,"Standard assumption, no changes"]
["General Input page",null,"Assumption input cell"]
[null,null,"Calculated cell"]
["Name of Program:"]
["Online Program, if yes, type \"Online Program\""]
["Revenue Type (see list below):"]
["Contact Name"]
{"$rows_left_out":9}
{"sheet":"UG Trad Input","index":5,"n_rows":20,"n_cols":37,"rows_kept":20,"cut":false,"hidden":true,"merged":[[0,30,0,36],[0,2,0,8],[0,9,0,15],[0,16,0,22],[0,23,0,29]]}
[null,null,"Year 1",null,null,null,null,null,null,"Year 2",null,null,null,null,null,null,"Year 3",null,null,null,null,null,null,"Year 4",null,null,null,null,null,null,"Year 5"]
["Traditional Undergraduate Program Revenue Assumptions:","Notes","Summer Year 1 Term 2","Fall Year 1 Term 1","Fall Year 1 Term 2","Winter Year 1","Spring Year 1 Term 1","Spring Year 1 Term 2","Summer Year 1 Term 1","Summer Year 2 Term 2","Fall Year 2 Term 1","Fall Year 2 Term 2","Winter Year 2","Spring Year 2 Term 1","Spring Year 2 Term 2","Summer Year 2 Term 1","Summer Year 3 Term 2","Fall Year 3 Term 1","Fall Year 3 Term 2","Winter Year 3","Spring Year 3 Term 1","Spring Year 3 Term 2","Summer Year 3 Term 1","Summer Year 4 Term 2","Fall Year 4 Term 1","Fall Year 4 Term 2","Winter Year 4","Spring Year 4 Term 1","Spring Year 4 Term 2","Summer Year 4 Term 1","Summer Year 5 Term 2","Fall Year 5 Term 1","Fall Year 5 Term 2","Winter Year 5","Spring Year 5 Term 1","Spring Year 5 Term 2","Summer Year 5 Term 1"]
["FTE Enrollment",null,null,{"$f":"SUM(D4:D7)","v":0},null,null,{"$f":"SUM(G4:G7)","v":0},null,null,null,{"$f":"SUM(K4:K7)","v":0},null,null,{"$f":"SUM(N4:N7)","v":0},null,null,null,{"$f":"SUM(R4:R7)","v":0},null,null,{"$f":"SUM(U4:U7)","v":0},null,null,null,{"$f":"SUM(Y4:Y7)","v":0},null,null,{"$f":"SUM(AB4:AB7)","v":0},null,null,null,{"$f":"SUM(AF4:AF7)","v":0},null,null,{"$f":"SUM(AI4:AI7)","v":0}]
["Freshmen"]
["Sophomore"]
["Junior"]
["Senior"]
["Tuition per FTE per semester","2013-2014",null,{"$f":"Assumptions!$B$7","v":16898},null,null,{"$f":"Assumptions!$B$7","v":16898},null,null,null,{"$f":"Assumptions!$C$7","v":17320},null,null,{"$f":"Assumptions!$C$7","v":17320},null,null,null,{"$f":"Assumptions!$D$7","v":17753},null,null,{"$f":"Assumptions!$D$7","v":17753},null,null,null,{"$f":"Assumptions!$E$7","v":18197},null,null,{"$f":"Assumptions!$E$7","v":18197},null,null,null,{"$f":"Assumptions!$F$7","v":18652},null,null,{"$f":"Assumptions!$F$7","v":18652}]
{"$rows_left_out":13}
{"sheet":"UG Non-Trad Input","index":6,"n_rows":16,"n_cols":37,"rows_kept":16,"cut":false,"hidden":true,"merged":[[0,30,0,36],[0,2,0,8],[0,9,0,15],[0,16,0,22],[0,23,0,29]]}
[null,null,"Year 1",null,null,null,null,null,null,"Year 2",null,null,null,null,null,null,"Year 3",null,null,null,null,null,null,"Year 4",null,null,null,null,null,null,"Year 5"]
["Non-Traditional Undergraduate Program Revenue Assumptions:","Notes","Summer Year 1 Term 2","Fall Year 1 Term 1","Fall Year 1 Term 2","Winter Year 1","Spring Year 1 Term 1","Spring Year 1 Term 2","Summer Year 1 Term 1","Summer Year 2 Term 2","Fall Year 2 Term 1","Fall Year 2 Term 2","Winter Year 2","Spring Year 2 Term 1","Spring Year 2 Term 2","Summer Year 2 Term 1","Summer Year 3 Term 2","Fall Year 3 Term 1","Fall Year 3 Term 2","Winter Year 3","Spring Year 3 Term 1","Spring Year 3 Term 2","Summer Year 3 Term 1","Summer Year 4 Term 2","Fall Year 4 Term 1","Fall Year 4 Term 2","Winter Year 4","Spring Year 4 Term 1","Spring Year 4 Term 2","Summer Year 4 Term 1","Summer Year 5 Term 2","Fall Year 5 Term 1","Fall Year 5 Term 2","Winter Year 5","Spring Year 5 Term 1","Spring Year 5 Term 2","Summer Year 5 Term 1"]
["Enrollment",null,{"$f":"SUM(C4:C7)","v":0},{"$f":"SUM(D4:D7)","v":0},0,0,0,0,0,0,0,0,0,0,0,0,0,0,0,0,0,0,0,0,0,0,0,0,0,0,0,0,0,0,0,0,0]
["Freshmen"]
["Sophomore"]
["Junior"]
["Senior"]
["Average number of credit hours per student"]
{"$rows_left_out":9}
{"sheet":"Grad Input","index":7,"n_rows":15,"n_cols":37,"rows_kept":15,"cut":false,"hidden":true,"merged":[[0,30,0,36],[0,2,0,8],[0,9,0,15],[0,16,0,22],[0,23,0,29]]}
[null,null,"Year 1",null,null,null,null,null,null,"Year 2",null,null,null,null,null,null,"Year 3",null,null,null,null,null,null,"Year 4",null,null,null,null,null,null,"Year 5"]
["Graduate Program Revenue Assumptions:","Notes","Summer Year 1 Term 2","Fall Year 1 Term 1","Fall Year 1 Term 2","Winter Year 1","Spring Year 1 Term 1","Spring Year 1 Term 2","Summer Year 1 Term 1","Summer Year 2 Term 2","Fall Year 2 Term 1","Fall Year 2 Term 2","Winter Year 2","Spring Year 2 Term 1","Spring Year 2 Term 2","Summer Year 2 Term 1","Summer Year 3 Term 2","Fall Year 3 Term 1","Fall Year 3 Term 2","Winter Year 3","Spring Year 3 Term 1","Spring Year 3 Term 2","Summer Year 3 Term 1","Summer Year 4 Term 2","Fall Year 4 Term 1","Fall Year 4 Term 2","Winter Year 4","Spring Year 4 Term 1","Spring Year 4 Term 2","Summer Year 4 Term 1","Summer Year 5 Term 2","Fall Year 5 Term 1","Fall Year 5 Term 2","Winter Year 5","Spring Year 5 Term 1","Spring Year 5 Term 2","Summer Year 5 Term 1"]
["Enrollment",null,{"$f":"SUM(C4:C5)","v":0},{"$f":"SUM(D4:D5)","v":0},0,0,0,0,0,0,0,0,0,0,0,0,0,0,0,0,0,0,0,0,0,0,0,0,0,0,0,0,0,0,0,0,0]
["1st Year Students"]
["2nd Year Students"]
["Average number of credit hours per student"]
["1st Year Students"]
["2nd Year Students"]
{"$rows_left_out":8}
{"sheet":"Certificate Input","index":8,"n_rows":14,"n_cols":37,"rows_kept":14,"cut":false,"hidden":true,"merged":[[0,30,0,36],[0,2,0,8],[0,9,0,15],[0,16,0,22],[0,23,0,29]]}
[null,null,"Year 1",null,null,null,null,null,null,"Year 2",null,null,null,null,null,null,"Year 3",null,null,null,null,null,null,"Year 4",null,null,null,null,null,null,"Year 5"]
["Certificate/Symposium/Seminar/Workshop Program Revenue Assumptions","Notes","Summer Year 1 Term 2","Fall Year 1 Term 1","Fall Year 1 Term 2","Winter Year 1","Spring Year 1 Term 1","Spring Year 1 Term 2","Summer Year 1 Term 1","Summer Year 2 Term 2","Fall Year 2 Term 1","Fall Year 2 Term 2","Winter Year 2","Spring Year 2 Term 1","Spring Year 2 Term 2","Summer Year 2 Term 1","Summer Year 3 Term 2","Fall Year 3 Term 1","Fall Year 3 Term 2","Winter Year 3","Spring Year 3 Term 1","Spring Year 3 Term 2","Summer Year 3 Term 1","Summer Year 4 Term 2","Fall Year 4 Term 1","Fall Year 4 Term 2","Winter Year 4","Spring Year 4 Term 1","Spring Year 4 Term 2","Summer Year 4 Term 1","Summer Year 5 Term 2","Fall Year 5 Term 1","Fall Year 5 Term 2","Winter Year 5","Spring Year 5 Term 1","Spring Year 5 Term 2","Summer Year 5 Term 1"]
["Certificate/Symposium/Seminar/Workshop Program Revenue Assumptions - Flat Rate Program:"]
["Enrollment"]
["Tuition per student",null,{"$f":"Assumptions!B10","v":1500},{"$f":"C5","v":1500},1500,1500,1500,1500,1500,{"$f":"Assumptions!$C$10","v":1538},{"$f":"J5","v":1538},1538,1538,1538,1538,1538,{"$f":"Assumptions!$D$10","v":1576},{"$f":"Q5","v":1576},1576,1576,1576,1576,1576,{"$f":"Assumptions!$E$10","v":1615},{"$f":"X5","v":1615},1615,1615,1615,1615,1615,{"$f":"Assumptions!$F$10","v":1655},{"$f":"AE5","v":1655},1655,1655,1655,1655,1655]
["Annual tuition increase",null,null,null,null,null,null,null,null,{"$f":"Assumptions!$C$6","v":2.5000000000000001E-2},null,null,null,null,null,null,{"$f":"Assumptions!$D$6","v":2.5000000000000001E-2},null,null,null,null,null,null,{"$f":"Assumptions!$E$6","v":2.5000000000000001E-2},null,null,null,null,null,null,{"$f":"Assumptions!$F$6","v":2.5000000000000001E-2}]
["Tuition",null,{"$f":"C4*C5","v":0},{"$f":"D4*D5","v":0},0,0,0,0,0,0,0,0,0,0,0,0,0,0,0,0,0,0,0,0,0,0,0,0,0,0,0,0,0,0,0,0,0]
[]
{"$rows_left_out":7}
{"sheet":"Endow&Gift Input","index":9,"n_rows":6,"n_cols":37,"rows_kept":6,"cut":false,"hidden":true,"merged":[[0,30,0,36],[0,2,0,8],[0,9,0,15],[0,16,0,22],[0,23,0,29]]}
[null,null,"Year 1",null,null,null,null,null,null,"Year 2",null,null,null,null,null,null,"Year 3",null,null,null,null,null,null,"Year 4",null,null,null,null,null,null,"Year 5"]
["Other Revenue Assumptions:","Notes","Summer Year 1 Term 2","Fall Year 1 Term 1","Fall Year 1 Term 2","Winter Year 1","Spring Year 1 Term 1","Spring Year 1 Term 2","Summer Year 1 Term 1","Summer Year 2 Term 2","Fall Year 2 Term 1","Fall Year 2 Term 2","Winter Year 2","Spring Year 2 Term 1","Spring Year 2 Term 2","Summer Year 2 Term 1","Summer Year 3 Term 2","Fall Year 3 Term 1","Fall Year 3 Term 2","Winter Year 3","Spring Year 3 Term 1","Spring Year 3 Term 2","Summer Year 3 Term 1","Summer Year 4 Term 2","Fall Year 4 Term 1","Fall Year 4 Term 2","Winter Year 4","Spring Year 4 Term 1","Spring Year 4 Term 2","Summer Year 4 Term 1","Summer Year 5 Term 2","Fall Year 5 Term 1","Fall Year 5 Term 2","Winter Year 5","Spring Year 5 Term 1","Spring Year 5 Term 2","Summer Year 5 Term 1"]
["Other Income:"]
["Endowment Income"]
["Gift Income"]
["Other Revenue"]

{"sheet":"Expense Input","index":10,"n_rows":53,"n_cols":37,"rows_kept":53,"cut":false,"hidden":true,"merged":[[0,30,0,36],[0,2,0,8],[0,9,0,15],[0,16,0,22],[0,23,0,29]]}
[null,null,"Year 1",null,null,null,null,null,null,"Year 2",null,null,null,null,null,null,"Year 3",null,null,null,null,null,null,"Year 4",null,null,null,null,null,null,"Year 5"]
["Expense Assumptions:","Notes","Summer Year 1 Term 2","Fall Year 1 Term 1","Fall Year 1 Term 2","Winter Year 1","Spring Year 1 Term 1","Spring Year 1 Term 2","Summer Year 1 Term 1","Summer Year 2 Term 2","Fall Year 2 Term 1","Fall Year 2 Term 2","Winter Year 2","Spring Year 2 Term 1","Spring Year 2 Term 2","Summer Year 2 Term 1","Summer Year 3 Term 2","Fall Year 3 Term 1","Fall Year 3 Term 2","Winter Year 3","Spring Year 3 Term 1","Spring Year 3 Term 2","Summer Year 3 Term 1","Summer Year 4 Term 2","Fall Year 4 Term 1","Fall Year 4 Term 2","Winter Year 4","Spring Year 4 Term 1","Spring Year 4 Term 2","Summer Year 4 Term 1","Summer Year 5 Term 2","Fall Year 5 Term 1","Fall Year 5 Term 2","Winter Year 5","Spring Year 5 Term 1","Spring Year 5 Term 2","Summer Year 5 Term 1"]
["Incremental Faculty FTEs"]
["Incremental Staff FTEs"]
[]
["Faculty Salaries to be added"]
["Adjunct faculty to be added"]
["Staff Salaries to be added"]
{"$rows_left_out":46}
{"sheet":"DEFS","index":11,"n_rows":8,"n_cols":1,"rows_kept":8,"cut":false,"hidden":true,"merged":[]}
[]
["Program Type"]
["Traditional Undergraduate Revenue"]
["Non-Traditional Undergraduate Revenue"]
["Graduate Program Revenue"]
["Certificate Program - Flat Rate"]
["Certificate Program - Credit Hour Based"]
["Other Revenue"]
{"$rows_left_out":1}
{"sheet":"prt_T_UG","index":12,"n_rows":19,"n_cols":9,"rows_kept":19,"cut":false,"hidden":false,"merged":[]}
[]
["New Program Financial Input"]
[null,"Program Name:"]
[null,"Program Type:",null,"Traditional Undergraduate Revenue"]
[null,"Contact Name:"]
[]
[null,"Traditional Undergrad - Expected Full Time Enrollment",null,"Year 1","Year 2","Year 3","Year 4","Year 5"]
[null,"Fall"]
{"$rows_left_out":12}
{"sheet":"prt_NT_UG","index":13,"n_rows":69,"n_cols":9,"rows_kept":69,"cut":false,"hidden":false,"merged":[]}
[]
["New Program Financial Input"]
[null,"Program Name:"]
[null,"Program Type:",null,"Non-Traditional Undergraduate Revenue"]
[null,"Contact Name:"]
[]
[null,"Non-Traditional Undergrad"]
[null,"Freshman Expected Enrollment"]
{"$rows_left_out":62}
{"sheet":"prt_GRAD","index":14,"n_rows":58,"n_cols":9,"rows_kept":58,"cut":false,"hidden":false,"merged":[]}
[]
["New Program Financial Input"]
[null,"Program Name:"]
[null,"Program Type:",null,"Graduate Program Revenue"]
[null,"Contact Name:"]
[]
[null,"Graduate "]
[null,"1st Year Students"]
{"$rows_left_out":51}
{"sheet":"prt_CERT_FR","index":15,"n_rows":26,"n_cols":9,"rows_kept":26,"cut":false,"hidden":false,"merged":[]}
[]
["New Program Financial Input"]
[null,"Program Name:"]
[null,"Program Type:",null,"Certificate Program - Flat Rate"]
[null,"Contact Name:"]
[]
[null,"Certificate Program - Flat Rate"]
[null,"Expected Enrollment"]
{"$rows_left_out":19}
{"sheet":"prt_CERT_CH","index":16,"n_rows":36,"n_cols":9,"rows_kept":36,"cut":false,"hidden":false,"merged":[]}
[]
["New Program Financial Input"]
[null,"Program Name:"]
[null,"Program Type:",null,"Certificate Program - Credit Hour Based"]
[null,"Contact Name:"]
[]
[null,"Certificate Program - Credit Hour Based"]
[null,"Expected Enrollment"]
{"$rows_left_out":29}
{"sheet":"prt_OthRev","index":17,"n_rows":12,"n_cols":9,"rows_kept":12,"cut":false,"hidden":false,"merged":[]}
[]
["New Program Financial Input"]
[null,"Program Name:"]
[null,"Program Type:",null,"Other Revenue"]
[null,"Contact Name:"]
[]
[null,"Other Revenue"]
[null,null,null,"Year 1","Year 2","Year 3","Year 4","Year 5"]
{"$rows_left_out":5}
{"sheet":"prt_Expenses","index":18,"n_rows":24,"n_cols":9,"rows_kept":24,"cut":false,"hidden":false,"merged":[]}
[]
["Expenses"]
[null,"Program Name:"]
[null,"Program Type:"]
[null,"Contact Name:"]
[]
[null,"Program Expenses"]
[null,null,null,"Year 1","Year 2","Year 3","Year 4","Year 5"]
{"$rows_left_out":16}